Subscribe: Zope | Dev
http://www.gossamer-threads.com/lists/zope/dev.xml
Added By: Feedage Forager Feedage Grade B rated
Language: English
Tags:
received zope  reports received  summary test  test reports  tests failed  tests  utc footnotes  utc utc  utc  zope tests  zope 
Rate this Feed
Rate this feedRate this feedRate this feedRate this feedRate this feed
Rate this feed 1 starRate this feed 2 starRate this feed 3 starRate this feed 4 starRate this feed 5 star

Comments (0)

Feed Details and Statistics Feed Statistics
Preview: Zope | Dev

Zope | Dev



Mailing List Archive by Gossamer Threads



Last Build Date: 21 Jan 2017 16:12:53 -0800

Copyright: (c) Gossamer Threads Inc. All rights reserved.
 



zope-tests - FAILED: 29, OK: 2, UNKNOWN: 10

20 Jan 2017 16:00:02 -0800

This is the summary for test reports received on the zope-tests list between 2017-01-19 00:00:00 UTC and 2017-01-20 00:00:00 UTC: See the footnotes



zope-tests - FAILED: 47, OK: 2

18 Jan 2017 16:00:03 -0800

This is the summary for test reports received on the zope-tests list between 2017-01-17 00:00:00 UTC and 2017-01-18 00:00:00 UTC: See the footnotes



zope-tests - FAILED: 57, OK: 2, UNKNOWN: 2

17 Jan 2017 16:00:02 -0800

This is the summary for test reports received on the zope-tests list between 2017-01-16 00:00:00 UTC and 2017-01-17 00:00:00 UTC: See the footnotes



zope-tests - FAILED: 44, OK: 2

15 Jan 2017 16:00:02 -0800

This is the summary for test reports received on the zope-tests list between 2017-01-14 00:00:00 UTC and 2017-01-15 00:00:00 UTC: See the footnotes



zope-tests - FAILED: 43, OK: 2

13 Jan 2017 16:00:02 -0800

This is the summary for test reports received on the zope-tests list between 2017-01-12 00:00:00 UTC and 2017-01-13 00:00:00 UTC: See the footnotes



zope-tests - FAILED: 39, OK: 2

12 Jan 2017 16:00:07 -0800

This is the summary for test reports received on the zope-tests list between 2017-01-11 00:00:00 UTC and 2017-01-12 00:00:00 UTC: See the footnotes



zope-tests - FAILED: 46, OK: 2

11 Jan 2017 16:00:07 -0800

This is the summary for test reports received on the zope-tests list between 2017-01-10 00:00:00 UTC and 2017-01-11 00:00:00 UTC: See the footnotes



zope-tests - FAILED: 45, OK: 2

10 Jan 2017 16:00:03 -0800

This is the summary for test reports received on the zope-tests list between 2017-01-09 00:00:00 UTC and 2017-01-10 00:00:00 UTC: See the footnotes



zope-tests - FAILED: 49, OK: 2

09 Jan 2017 16:00:02 -0800

This is the summary for test reports received on the zope-tests list between 2017-01-08 00:00:00 UTC and 2017-01-09 00:00:00 UTC: See the footnotes



zope-tests - FAILED: 37, OK: 2

07 Jan 2017 16:00:03 -0800

This is the summary for test reports received on the zope-tests list between 2017-01-06 00:00:00 UTC and 2017-01-07 00:00:00 UTC: See the footnotes